Results 1 to 3 of 3

Thread: request for YU YUREKA

  1. #1
    Join Date

    help me correct my errors plz

    Last edited by deepaks; 2015-04-02 at 13:56.

  2. #2
    Join Date
    /home/deepak/arm-stuff/kali-nethunter/1/arch/x86/Makefile:98: stack protector enabled but no compiler support
    SYSHDR arch/x86/syscalls/../include/generated/asm/unistd_32_ia32.h
    SYSHDR arch/x86/syscalls/../include/generated/asm/unistd_64_x32.h
    SYSTBL arch/x86/syscalls/../include/generated/asm/syscalls_64.h
    make[1]: Nothing to be done for `relocs'.
    WRAP arch/x86/include/generated/asm/clkdev.h
    CHK include/generated/uapi/linux/version.h
    UPD include/generated/uapi/linux/version.h
    CHK include/generated/utsrelease.h
    UPD include/generated/utsrelease.h
    CC kernel/bounds.s
    GEN include/generated/bounds.h
    CC arch/x86/kernel/asm-offsets.s
    GEN include/generated/asm-offsets.h
    CALL scripts/
    HOSTCC scripts/genksyms/genksyms.o
    SHIPPED scripts/genksyms/lex.lex.c
    SHIPPED scripts/genksyms/keywords.hash.c
    SHIPPED scripts/genksyms/
    HOSTCC scripts/genksyms/lex.lex.o
    SHIPPED scripts/genksyms/
    HOSTCC scripts/genksyms/
    HOSTLD scripts/genksyms/genksyms
    CC scripts/mod/empty.o
    HOSTCC scripts/mod/mk_elfconfig
    MKELF scripts/mod/elfconfig.h
    CC scripts/mod/devicetable-offsets.s
    GEN scripts/mod/devicetable-offsets.h
    HOSTCC scripts/mod/file2alias.o
    HOSTCC scripts/mod/modpost.o
    HOSTCC scripts/mod/sumversion.o
    HOSTLD scripts/mod/modpost
    HOSTCC scripts/selinux/genheaders/genheaders
    HOSTCC scripts/selinux/mdp/mdp
    HOSTCC scripts/kallsyms
    HOSTCC scripts/conmakehash
    HOSTCC scripts/recordmcount
    HOSTCC scripts/sortextable
    HOSTCC scripts/asn1_compiler
    CC init/main.o
    CHK include/generated/compile.h
    UPD include/generated/compile.h
    CC init/version.o
    CC init/do_mounts.o
    CC init/do_mounts_rd.o
    CC init/do_mounts_initrd.o
    CC init/do_mounts_md.o
    LD init/mounts.o
    CC init/initramfs.o
    CC init/calibrate.o
    CC init/init_task.o
    LD init/built-in.o
    HOSTCC usr/gen_init_cpio
    GEN usr/initramfs_data.cpio
    AS usr/initramfs_data.o
    LD usr/built-in.o
    CC arch/x86/crypto/crc32c-intel_glue.o
    AS arch/x86/crypto/crc32c-pcl-intel-asm_64.o
    LD arch/x86/crypto/crc32c-intel.o
    LD arch/x86/crypto/built-in.o
    CC [M] arch/x86/crypto/ablk_helper.o
    CC [M] arch/x86/crypto/glue_helper.o
    AS [M] arch/x86/crypto/aes-x86_64-asm_64.o
    CC [M] arch/x86/crypto/aes_glue.o
    AS [M] arch/x86/crypto/aesni-intel_asm.o
    CC [M] arch/x86/crypto/aesni-intel_glue.o
    CC [M] arch/x86/crypto/fpu.o
    AS [M] arch/x86/crypto/crc32-pclmul_asm.o
    CC [M] arch/x86/crypto/crc32-pclmul_glue.o
    LD [M] arch/x86/crypto/aes-x86_64.o
    LD [M] arch/x86/crypto/aesni-intel.o
    LD [M] arch/x86/crypto/crc32-pclmul.o
    CC arch/x86/kernel/process_64.o
    CC arch/x86/kernel/signal.o
    AS arch/x86/kernel/entry_64.o
    CC arch/x86/kernel/traps.o
    CC arch/x86/kernel/irq.o
    CC arch/x86/kernel/irq_64.o
    CC arch/x86/kernel/dumpstack_64.o
    CC arch/x86/kernel/time.o
    CC arch/x86/kernel/ioport.o
    CC arch/x86/kernel/ldt.o
    CC arch/x86/kernel/dumpstack.o
    CC arch/x86/kernel/nmi.o
    CC arch/x86/kernel/setup.o
    CC arch/x86/kernel/x86_init.o
    CC arch/x86/kernel/i8259.o
    CC arch/x86/kernel/irqinit.o
    CC arch/x86/kernel/jump_label.o
    CC arch/x86/kernel/irq_work.o
    CC arch/x86/kernel/probe_roms.o
    CC arch/x86/kernel/sys_x86_64.o
    CC arch/x86/kernel/x8664_ksyms_64.o
    CC arch/x86/kernel/syscall_64.o
    CC arch/x86/kernel/vsyscall_64.o
    AS arch/x86/kernel/vsyscall_emu_64.o
    CC arch/x86/kernel/bootflag.o
    CC arch/x86/kernel/e820.o
    CC arch/x86/kernel/pci-dma.o
    arch/x86/kernel/pci-dma.c: In function ‘dma_generic_alloc_coherent’:
    arch/x86/kernel/pci-dma.c:104:8: warning: assignment makes pointer from integer without a cast [enabled by default]
    error, forbidden warning: pci-dma.c:104
    make[2]: *** [arch/x86/kernel/pci-dma.o] Error 1
    make[1]: *** [arch/x86/kernel] Error 2
    make: *** [arch/x86] Error 2

    help me

  3. #3
    Join Date
    Executing apt-get install -y git-core gnupg flex bison gperf libesd0-dev build-essential zip curl libncurses5-dev zlib1g-dev libncurses5-dev gcc-multilib g++-multilib parted kpartx debootstrap pixz qemu-user-static abootimg cgpt vboot-kernel-utils vboot-utils uboot-mkimage bc lzma lzop automake autoconf m4 dosfstools rsync schedtool git e2fsprogs device-tree-compiler ccache dos2unix
    Reading package lists...
    Building dependency tree...
    Reading state information...
    Package uboot-mkimage is not available, but is referred to by another package.
    This may mean that the package is missing, has been obsoleted, or
    is only available from another source
    However the following packages replace it:

    E: Package 'uboot-mkimage' has no installation candidate
    There are fatal issues during the installation, the rest packages cannot be installed until you solve the errors.

Similar Threads

  1. Community Request
    By kaungthant in forum Community Feedback
    Replies: 0
    Last Post: 2020-02-25, 08:24
  2. [A request for a break]
    By Gina in forum Installing Archive
    Replies: 0
    Last Post: 2020-01-26, 21:54
  3. Package/app request
    By devilsadvocate in forum Development Archive
    Replies: 1
    Last Post: 2016-01-03, 00:32

Posting Permissions

  • You may not post new threads
  • You may not post replies
  • You may not post attachments
  • You may not edit your posts